2020年7月1日水曜日

cannot VACUUM from within a transaction

センサーログのスクリプトを10分単位で動かしていましたが、試しに1分単位に動かしてみたところ、意外なところで想定外になってしまったようでグラフの表示やら、日時でテンポラリからストレージに移動しているスクリプトが動いてなかったり。
単純にデータ量が1日当たり144件から10倍の1440件になるので、どこかでおかしくなるかとは思っていましたが、それでも想定外でした。

Jul  1 02:03:01 rasp4b4g CRON[9173]: (root) CMD (/usr/local/sbin/savetosd.py)
Jul  1 02:03:01 rasp4b4g CRON[9164]: (CRON) info (No MTA installed, discarding output)

cronのログはsyslogにキックしたログはありましたが、エラーの出力は無い様なので、実際に動かしてみました。(メール設定をしていればエラーがメールで飛んでいく設定を作れるから設定しておいた方が良いかも…)

pi@rasp4b4g:~ $ sudo python3 /usr/local/sbin/savetosd.py
cannot VACUUM from within a transaction

VACUUMでエラーが出ているようです。
ググってみると、トランザクション中にVACUUMを行うとエラーが発生することがあるらしいのでスクリプトを確認してみると…
  1. テーブル間のデータコピー
  2. テンポラリテーブルのデータ削除
  3. VACUUM
  4. commit()
なんで、commitする前にVACUUMさせていたのかは謎ですが、今までVACUUMはトランザクションに影響しないというより、暗礁のcommitが行われてしまうものだとばかり思っていましたが、そうではなくトランザクションとして処理していてバッファが足りなくなったらしっかりエラーを吐き出すようですね。
  1. テーブル間のデータコピー
  2. テンポラリテーブルのデータ削除
  3. commit()
  4. VACUUM
という順序に入れ替えて実行してみると処理が通るようになりました。
グラフの表示が崩れていたのも、正常に戻ったので、グラフ表示させているスクリプトでテンポラリ内のデータが1日以上になってしまうと都合が悪い作りになってるようですね…





関係がありそうなインストール済みのパッケージ
libsqlite3-0:armhf                    3.27.2-3                               armhf        SQLite 3 shared library
php-sqlite3 2:7.3+69 all SQLite3 module for PHP [default]
php7.3-sqlite3 7.3.14-1~deb10u1 armhf SQLite3 module for PHP
libaprutil1-dbd-sqlite3:armhf 1.6.1-4 armhf Apache Portable Runtime Utility Library - SQLite3 Driver
libqt5sql5-sqlite:armhf 5.11.3+dfsg1-1+rpi1+deb10u3 armhf Qt 5 SQLite 3 database driver
スクリプトのpython3上でバージョンの確認
pi@rasp4b4g:~ $ python3
Python 3.7.3 (default, Dec 20 2019, 18:57:59)
[GCC 8.3.0] on linux
Type "help", "copyright", "credits" or "license" for more information.
>>> import sqlite3
>>> sqlite3.sqlite_version
'3.27.2'
>>> exit()

2020年6月24日水曜日

passwd

理想はすべてのアカウントパスワードはある程度の強固なもので、それぞれ違うものをきちんと設定すべきです。

が、

一つ二つならまだしも、手持ちのデバイスが増えるにつれ、正直管理なんてできません。
実際は、使用用途によっていくつか決まったパスワードを使いまわすことが多いいわけですが、Raspberry piにターミナルでログインするたびに、パスワードを設定しろとしつこく表示されるのでパスワードの設定をしようとしてみると、

Bad: new password is too simple

と表示され、変更できず。複雑なパスワードにするべきなのはわかってはいるんですけどね。

何とかしたいので、管理者権限で

$ sudo passwd pi

とすれば、確認のパスワードも必要なく、パスワードチェックもされません。

忘れそうなのでメモメモw

2020年4月26日日曜日

セルの書式:億万の単位表示

日本人だと4桁区切りにすると読みやすいですが、カンマは3桁区切りが一般的。
不用意に4桁区切りにするよりは、どうせならとうまい表示方法はないかと調べてみると、書式設定に「####億####万####」と設定すれば良さそうですが、万単位の時に不要な「億」が表示されてしまうので条件を付けくわえて

[>100000000]####億####万####;[>10000]####万####;####

とすることでそれなりに。

これでも不要そうなゼロが消えないので、そこまでやらせようとすると表示用の別のセルにマクロや数式に頼ることになるかと。

コロナ騒ぎで計算するときに人口ベースの比率を計算するときに、桁が良く分からなくなので表計算上で数字を置いておくのに便利です。

2018年10月9日火曜日

i2cデバイスのアドレス確認

必要なパッケージ
i2c-tools
なければsudo apt-get install i2c-toolsでインストール

コマンド
i2cdetect -y 1

pi@rasp3b:~ $ i2cdetect -y 1
     0  1  2  3  4  5  6  7  8  9  a  b  c  d  e  f
00:          -- -- -- -- -- -- -- -- -- -- -- -- --
10: -- -- -- -- -- -- -- -- -- -- -- -- -- -- -- --
20: -- -- -- -- -- -- -- -- -- -- -- -- -- -- -- --
30: -- -- -- -- -- -- -- -- -- -- -- -- -- -- -- 3f
40: -- -- -- -- -- -- -- -- -- -- -- -- -- -- -- --
50: -- -- -- -- -- -- -- -- -- -- -- -- -- -- -- --
60: -- -- -- -- -- -- -- -- -- -- -- -- -- -- -- --
70: -- -- -- -- -- -- 76 77

i2cに接続されているアドレスが表示されるので、接続前と後で見比べればどのアドレスに接続されたかわかる。

参考というか元ネタ
http://robocad.blog.jp/archives/729192.html

2018年9月23日日曜日

Failed to resolve: com.google.firebase:firebase-ads:16.0.3

結果から言えば firebase-ads: 16.0.3はStable channelではリリースされていない。
公式のドキュメント(https://firebase.google.com/docs/android/setup)を見たところ
com.google.firebase:firebase-ads:15.0.1 AdMob
となっていた。なのでおそらく
implementation 'com.google.firebase:firebase-ads:15.0.1'
と書き換えるだけでよかったのだと思う。

スタックオーバーフローでは
'com.google.firebase:firebase-core:16.0.3' (16.0.1だったかも)
をfirebase-adsの前に追加して
プロジェクトの build.gradleの
classpath 'com.android.tools.build:gradle:3.1.4'
classpath 'com.google.gms:google-services:4.0.2'
の記述があることを確認すれば解決するとかそんな感じだった。
(この話は公式ドキュメントのfirebaseを実装する手順の話になる)

正直色々と試行錯誤して半日以上費やしたが、結果からすればエラーメッセージの通り単純にfirebase-ads: 16.0.3の解決が失敗した。というのはあれなのだが、もうちょっとなんとかしてほしいものだ(笑)
例えば version 16.0.3が見つからない。存在するバージョンは15.0.1 とか表示すればアプローチがガラッと変わるのだが…

implementation 'com.android.support:appcompat-v7:26.1.0'

dependencies節のcompile(非推奨)からimplementationへの置き換え作業にて。

エラー表示がされたまま解除できなかったので試行錯誤の結果
testImplementation 'junit:junit:4.12'
をコメントアウトすることでエラー表示が無くなった。理由は不明
念のためほぼ使用していないtest関連もコメントアウト状態にした。

この時の環境
Android Studio 3.1.4
gradle 4.4
classpath 'com.android.tools.build:gradle:3.1.4'
classpath 'com.google.gms:google-services:4.0.2'

2018年8月11日土曜日

:app:lintVitalRelease FAILED

API Level 28がリリースされ、PlayStore上でAPI制限が上げられてきたのでAPIレベルを変えてリコンパイルする作業でエラーが出てきました。

この手のエラーはデバッグ用のビルドではエラーが出ず、リリース用のビルドでエラーが発生しますね…今回もリリースビルドでエラーが出てしまい、クリーンしたり、toolVersionを最新のものにしたり色々してみましたが変化しませんでした。

:app:lintVitalRelease FAILED

FAILURE: Build failed with an exception.

* What went wrong:
Execution failed for task ':app:lintVitalRelease'.
> Could not resolve all files for configuration ':app:lintClassPath'.
   > Could not find com.android.tools.lint:lint-gradle:26.1.4.
     Searched in the following locations:
         file:/C:/Android/SDK/extras/m2repository/com/android/tools/lint/lint-gradle/26.1.4/lint-gradle-26.1.4.pom
         file:/C:/Android/SDK/extras/m2repository/com/android/tools/lint/lint-gradle/26.1.4/lint-gradle-26.1.4.jar
         file:/C:/Android/SDK/extras/google/m2repository/com/android/tools/lint/lint-gradle/26.1.4/lint-gradle-26.1.4.pom
         file:/C:/Android/SDK/extras/google/m2repository/com/android/tools/lint/lint-gradle/26.1.4/lint-gradle-26.1.4.jar
         file:/C:/Android/SDK/extras/android/m2repository/com/android/tools/lint/lint-gradle/26.1.4/lint-gradle-26.1.4.pom
         file:/C:/Android/SDK/extras/android/m2repository/com/android/tools/lint/lint-gradle/26.1.4/lint-gradle-26.1.4.jar
         https://jcenter.bintray.com/com/android/tools/lint/lint-gradle/26.1.4/lint-gradle-26.1.4.pom
         https://jcenter.bintray.com/com/android/tools/lint/lint-gradle/26.1.4/lint-gradle-26.1.4.jar
     Required by:
         project :app

* Try:
Run with --stacktrace option to get the stack trace. Run with --info or --debug option to get more log output. Run with --scan to get full insights.

* Get more help at https://help.gradle.org

BUILD FAILED in 14s
17 actionable tasks: 1 executed, 16 up-to-date

メッセージ中の「lint-gradle:26.1.4」という部分がtoolVersionを変更しても変化しないというのが気になったのですが、正直八方塞がりになってしましました。

こんな時に一番役立つのはやはりAPI Levelを設定したうえで新規プロジェクトを作成して比較するということ。バグではない限り大概これで足りない記述や変更された記述を転記してやれば正常にコンパイルできるようになります。

確認したところ、プロジェクトレベルのbuild.gradle内に
allprojects {
    repositories {
        google()
        jcenter()
    }
}

task clean(type: Delete) {
    delete rootProject.buildDir
}
赤い文字の部分が追加されていました。
今までエラーが出ていたプロジェクトに追記したところエラーが出なくなりました。

直接のビルドエラーの原因はgradleのバージョンアップでリポジトリを強制追加しない感じになったのでしょうかね。